{"text_format":"1","workbook":"xlsx","n_sheets":18,"sheets":["INSTRUCTIONS","CERTIFICATION","START","_REF","WATER","_SDC Water","SEWER","_SDC Sewer","STREETS","_SDC Transportation","STORM","_SDC Storm","PARKS","_SDC Parks","VOUCHERS","_SDC Vouchers","SUMMARY","_ITE Codes"],"not_rendered":{"charts":0,"images":6,"macros":1,"external_links":0,"defined_names":238,"comments":2,"pivot_tables":0},"unopened":[],"bounds":{"document_bytes":16777216,"sheet_cells":100000,"rows_first":2000,"rows_last":500,"rows_between":2000,"halvings":0,"cell_chars":16384,"cell_head_chars":4096},"cells_cut":0,"cells_raw":0,"read":"whole","date_system":"1900"}

{"sheet":"INSTRUCTIONS","index":0,"n_rows":107,"n_cols":7,"rows_kept":107,"cut":false,"hidden":false,"merged":[[106,1,106,7],[99,1,99,7],[100,1,100,7],[101,1,101,7],[102,1,102,7],[103,1,103,7],[104,1,104,7],[105,1,105,7],[86,1,86,7],[82,1,82,7],[87,1,87,7],[88,1,88,7],[63,1,63,3],[75,1,75,7],[66,1,66,7],[68,1,68,7],[71,1,71,7],[74,1,74,7],[73,1,73,7],[67,1,67,7],[83,1,83,7],[79,1,79,2],[72,1,72,7],[90,1,90,7],[91,1,91,7],[92,1,92,7],[93,1,93,7],[1,1,2,5],[1,6,1,7],[2,6,2,7],[9,1,9,7],[10,1,10,3],[28,1,28,7],[29,1,29,7],[35,1,35,7],[36,1,36,7],[37,1,37,7],[41,1,41,7],[40,1,40,7],[96,1,96,2],[47,1,47,2],[32,1,32,2],[13,1,13,7],[76,1,76,7],[70,1,70,7],[84,1,84,7],[89,1,89,7],[38,1,38,7],[39,1,39,7],[42,1,42,7],[85,1,85,7],[60,1,60,7],[15,1,15,7],[69,1,69,7],[27,1,27,7],[44,1,44,7],[21,1,21,7],[11,1,11,7],[12,1,12,7],[59,1,59,7],[53,1,53,7],[54,1,54,7],[55,1,55,7],[52,1,52,7],[58,1,58,7],[43,1,43,7],[56,1,56,7],[57,1,57,7],[14,1,14,7],[50,1,50,7],[51,1,51,7]]}
[]
[null,"HOW TO » CALCULATOR INSTRUCTIONS",null,null,null,null,"City of Wilsonville, OR"]
[null,null,null,null,null,null,"Community Development"]
[]
[]
[]
[null,"GENERAL INSTRUCTIONS"]
[]
{"$rows_left_out":100}
{"sheet":"CERTIFICATION","index":1,"n_rows":20,"n_cols":17,"rows_kept":20,"cut":false,"hidden":false,"merged":[[19,1,19,16],[12,3,12,11],[12,13,12,15],[1,1,2,13],[1,16,1,17],[2,16,2,17],[5,4,5,13],[8,1,8,16],[10,1,10,16],[9,1,9,16],[18,1,18,13],[13,13,13,15],[13,3,13,11]]}
[]
[null,"ESTIMATE CERTIFICATION",null,null,null,null,null,null,null,null,null,null,null,null,null,null,"City of Wilsonville, OR"]
[null,null,null,null,null,null,null,null,null,null,null,null,null,null,null,null,"Community Development"]
[]
[]
[null,"SUBJECT PROPERTY:",null,null,{"$f":"IF(ISBLANK(START!SITEADDR),\"\",IF(ISBLANK(START!SUITE),START!SITEADDR,START!SITEADDR & \", \" & START!SUITE))","v":""}]
[]
[null,"CERTIFICATION AND UNDERSTANDING OF APPLICANT"]
{"$rows_left_out":13}
{"sheet":"START","index":2,"n_rows":43,"n_cols":7,"rows_kept":43,"cut":false,"hidden":false,"merged":[[21,1,21,2],[14,1,14,2],[18,1,18,6],[17,1,17,6],[16,1,16,6],[21,4,21,6],[15,1,15,2],[22,4,22,6],[29,1,29,4],[29,5,29,6],[27,1,27,2],[27,4,27,6],[23,5,23,6],[24,5,24,6],[24,1,24,4],[30,1,30,4],[30,5,30,6],[1,0,2,0],[1,1,2,5],[3,0,4,0],[3,1,4,4],[1,6,1,7],[2,6,2,7],[3,6,3,7],[4,6,4,7],[28,1,28,2],[28,4,28,6],[22,1,22,2],[23,1,23,4],[9,1,9,2],[10,1,10,2],[32,1,32,2],[42,5,42,6],[43,5,43,6],[42,3,42,4],[43,3,43,4],[35,1,35,2],[36,1,36,2],[43,1,43,2],[42,1,42,2],[33,4,33,5],[34,4,34,5],[37,1,37,2],[38,1,38,2]]}
[]
[null,"SYSTEM DEVELOPMENT CHARGES (SDC)",null,null,null,null,"City of Wilsonville, OR"]
[null,null,null,null,null,null,"Community Development"]
[null,"ESTIMATE CALCULATOR",null,null,null,null,"29799 SW Town Center Loop East"]
[null,null,null,null,null,null,"Wilsonville, OR 97070"]
[]
[]
[null,"PERMIT INFORMATION"]
{"$rows_left_out":36}
{"sheet":"_REF","index":3,"n_rows":19,"n_cols":4,"rows_kept":19,"cut":false,"hidden":true,"merged":[]}
["Category ID","Categories","Use ID","Use"]
["R","Residential",1,1]
["C/I","Commercial",2,2]
["C/I","Industrial",3,3]
[]
[null,"County of Jurisdiction"]
[null,"Clackamas"]
[null,"Washington"]
{"$rows_left_out":12}
{"sheet":"WATER","index":4,"n_rows":60,"n_cols":9,"rows_kept":60,"cut":false,"hidden":false,"merged":[[62,3,62,7],[27,8,27,9],[32,4,33,5],[45,3,45,5],[51,3,51,4],[52,3,52,4],[53,3,53,4],[44,3,44,5],[29,3,29,6],[2,8,2,9],[1,3,2,7],[39,3,39,5],[38,3,38,5],[1,8,1,9],[5,4,5,7],[21,3,21,7],[23,8,26,9]]}
[]
[null,null,null,"CHARGES & CREDITS » WATER",null,null,null,null,"City of Wilsonville, OR"]
[null,null,null,null,null,null,null,null,"Community Development"]
[]
[]
["HIDE","TYPE",null,"SUBJECT PROPERTY:",{"$f":"IF(ISBLANK(START!SITEADDR),\"\",IF(ISBLANK(START!SUITE),START!SITEADDR,START!SITEADDR & \", \" & START!SUITE))","v":""}]
[]
[]
{"$rows_left_out":53}
{"sheet":"_SDC Water","index":5,"n_rows":37,"n_cols":12,"rows_kept":37,"cut":false,"hidden":true,"merged":[]}
["SDC Table: Water"]
[]
["Flow Factor","Meter Size","Meter Size Value","Meter Install Cost","Water SDC","Total",null,null,null,4.0000000000000001E-3,"(percent change)"]
[0,"0\"",0,0,0,{"$f":"WaterSDC[[#This Row],[Meter Install Cost]]+WaterSDC[[#This Row],[Water SDC]]","v":0},null,null,0,{"$f":"I4*(1+$J$3)","v":0}]
[1,"5/8\" x 3/4\"",0.625,312,{"$f":"J5","v":12440.564},{"$f":"WaterSDC[[#This Row],[Meter Install Cost]]+WaterSDC[[#This Row],[Water SDC]]","v":12752.564},null,null,12391,{"$f":"I5*(1+$J$3)","v":12440.564},{"$f":"ROUND(J5,0)","v":12441},{"$f":"WaterSDC[[#This Row],[Water SDC]]-K5","v":-0.43599999999969441}]
[1.5,"3/4\" x 3/4\"",0.75,364,{"$f":"$E$5*WaterSDC[[#This Row],[Flow Factor]]","v":18660.846000000001},{"$f":"WaterSDC[[#This Row],[Meter Install Cost]]+WaterSDC[[#This Row],[Water SDC]]","v":19024.846000000001}]
[2.5,"1\"",1,395,{"$f":"$E$5*WaterSDC[[#This Row],[Flow Factor]]","v":31101.41},{"$f":"WaterSDC[[#This Row],[Meter Install Cost]]+WaterSDC[[#This Row],[Water SDC]]","v":31496.41}]
[5,"1-1/2\"",1.5,676,{"$f":"$E$5*WaterSDC[[#This Row],[Flow Factor]]","v":62202.82},{"$f":"WaterSDC[[#This Row],[Meter Install Cost]]+WaterSDC[[#This Row],[Water SDC]]","v":62878.82}]
{"$rows_left_out":30}
{"sheet":"SEWER","index":6,"n_rows":170,"n_cols":10,"rows_kept":170,"cut":false,"hidden":false,"merged":[[172,4,172,9],[20,4,20,9],[103,4,103,8],[102,4,102,9],[134,4,134,9],[92,4,92,9],[144,4,144,6],[58,4,58,7],[96,6,96,7],[99,4,99,8],[100,4,100,7],[24,4,24,8],[48,7,48,8],[54,6,54,7],[22,4,22,7],[25,4,25,9],[1,4,2,8],[1,9,1,10],[2,9,2,10],[50,4,50,9],[57,4,57,8],[5,5,5,9],[21,4,21,7],[16,7,16,8],[17,7,17,8],[10,4,10,8],[11,4,11,6],[12,4,12,6],[13,4,13,8],[14,4,14,8],[15,4,15,8],[163,4,163,6],[59,4,59,7],[23,4,23,9],[143,4,143,6],[104,4,104,9],[90,7,90,8],[60,4,60,9],[62,4,62,9],[101,4,101,7],[138,6,138,7],[61,4,61,8],[132,7,132,8],[149,4,149,6],[150,4,150,6],[155,4,155,6],[156,4,156,6],[157,4,157,6],[159,4,159,6],[160,4,160,6],[161,4,161,6],[162,4,162,6]]}
[]
[null,null,null,null,"CHARGES & CREDITS » SANITARY SEWER",null,null,null,null,"City of Wilsonville, OR"]
[null,null,null,null,null,null,null,null,null,"Community Development"]
[]
[]
["HIDE","TYPE","USE",null,"SUBJECT PROPERTY:",{"$f":"IF(ISBLANK(START!SITEADDR),\"\",IF(ISBLANK(START!SUITE),START!SITEADDR,START!SITEADDR & \", \" & START!SUITE))","v":""}]
[]
[]
{"$rows_left_out":163}
{"sheet":"_SDC Sewer","index":7,"n_rows":42,"n_cols":15,"rows_kept":42,"cut":false,"hidden":true,"merged":[]}
["SDC Table: Sewer"]
[]
["Development Type","Development Category","Unit","Unit Long","Cost per Unit","Description",null,null,null,null,null,1.004]
["Single Family Dwelling","Residential","DU","Dwelling Unit",{"$f":"M4","v":7130},"Shall mean a residential structure which is occupied by one or more persons of which there shall be only one dwelling structure per lot and which provides complete, independent living facilities for one or more persons including, but not limited to, permanent provisions for living, sleeping, eating, cooking and sanitation.",null,null,null,null,7102,{"$f":"K4*$L$3","v":7130.4080000000004},{"$f":"ROUND(L4,0)","v":7130},{"$f":"ROUND((M4/K4)-1,3)","v":4.0000000000000001E-3},{"$f":"SewerSDC[[#This Row],[Cost per Unit]]-M4","v":0}]
["Multi-Family Dwelling","Residential","DU","Dwelling Unit",{"$f":"M5","v":5350},"Shall mean a residential structure which is occupied by one or more persons of which there is more than one dwelling structure per lot, according to approved zoning requirements and which provides complete independent living facilities for each dwelling structure including, but not limited to, permanent provisions for living, sleeping, eating, cooking and sanitation.",null,null,null,null,5329,{"$f":"K5*$L$3","v":5350.3159999999998},{"$f":"ROUND(L5,0)","v":5350},{"$f":"ROUND((M5/K5)-1,3)","v":4.0000000000000001E-3},{"$f":"SewerSDC[[#This Row],[Cost per Unit]]-M5","v":0}]
["Manufactured Home","Residential","DU","Dwelling Unit",7130,"Shall mean a structure which is intended for human occupancy by one or more persons that has sleeping, eating, cooking and plumbing-sanitation facilities and which is constructed off- site in compliance with Uniform Building Code (Oregon State Structural Specialty Code) and designed to be transported to a site for installation and/or assembly of modular components to form a permanent structure.",null,null,null,null,7102,7130.4080000000004,7130,4.0000000000000001E-3,{"$f":"SewerSDC[[#This Row],[Cost per Unit]]-M6","v":0}]
["Hotel/Motel @ 25 EFU","Residential","DU","Dwelling Unit",7130,"Shall mean any building which is designed or used to offer lodging for rent or hire, with or without meals for four or more people or containing six or more guest rooms.",null,null,null,null,7102,7130.4080000000004,7130,4.0000000000000001E-3,{"$f":"SewerSDC[[#This Row],[Cost per Unit]]-M7","v":0}]
["Banks","Commercial","EDU","Equivalent Dwelling Unit",7846,"Shall mean those institutions that are engaged in deposit baking or closely related functions including fiduciary activities. A more complete description and examples are included in SIC, Major Group 60 – Depository Institutions.",null,null,null,null,7815,7846.26,7846,4.0000000000000001E-3,{"$f":"SewerSDC[[#This Row],[Cost per Unit]]-M8","v":0}]
{"$rows_left_out":35}
{"sheet":"STREETS","index":8,"n_rows":252,"n_cols":10,"rows_kept":252,"cut":false,"hidden":false,"merged":[[245,4,245,6],[1,9,1,10],[2,9,2,10],[5,5,5,8],[40,4,40,6],[41,4,41,6],[9,4,9,8],[1,4,2,8],[19,5,19,8],[42,4,42,8],[43,4,43,8],[44,4,44,8],[110,4,110,8],[109,4,109,8],[108,4,108,8],[79,4,79,7],[254,4,254,8],[216,4,216,6],[217,7,217,8],[218,7,218,8],[215,4,215,6],[231,4,231,6],[230,4,230,6],[229,4,229,7],[228,4,228,7],[227,4,227,7],[239,4,239,6],[238,4,238,6],[220,4,220,8],[242,4,242,6],[243,4,243,6],[244,4,244,6],[13,4,13,7],[14,4,14,7],[15,4,15,7],[17,5,17,8],[18,5,18,8],[183,7,183,8],[176,4,176,6],[149,4,149,6],[68,4,68,6],[66,4,66,8],[80,4,80,7],[81,4,81,7],[83,5,83,8],[69,4,69,6],[72,4,72,8],[106,4,106,6],[70,7,70,8],[71,7,71,8],[85,5,85,8],[84,5,84,8],[192,4,192,8],[191,4,191,8],[190,4,190,8],[132,4,132,8],[138,4,138,8],[134,4,134,6],[136,7,136,8],[137,7,137,8],[141,7,141,8],[142,7,142,8],[189,4,189,6],[177,7,177,8],[178,7,178,8],[179,4,179,8],[173,4,173,8],[182,7,182,8],[64,4,64,8],[52,4,58,5],[213,4,213,8],[222,7,222,8],[223,7,223,8],[75,7,75,8],[76,7,76,8],[219,4,219,8],[148,4,148,6],[152,4,152,8],[151,4,151,8],[150,4,150,8],[107,4,107,6],[188,4,188,6],[175,4,175,6],[135,4,135,6]]}
[]
[null,null,null,null,"CHARGES & CREDITS » TRANSPORTATION",null,null,null,null,"City of Wilsonville, OR"]
[null,null,null,null,null,null,null,null,null,"Community Development"]
[]
[]
["HIDE","TYPE","USE",null,"SUBJECT PROPERTY:",{"$f":"IF(ISBLANK(START!SITEADDR),\"\",IF(ISBLANK(START!SUITE),START!SITEADDR,START!SITEADDR & \", \" & START!SUITE))","v":""}]
[]
[]
{"$rows_left_out":245}
{"sheet":"_SDC Transportation","index":9,"n_rows":160,"n_cols":17,"rows_kept":160,"cut":false,"hidden":true,"merged":[]}
["SDC Table: Transportation"]
[{"$f":"(148715-89280)/(93993-57022)","v":1.607611371074626}]
["ITE Code","Land Use","ITE-Land Use","Unit","Unit Scale","Unit Name","Unit Name Long","Input Unit","ITE Average Daily Trips","Primary Trip Adjustments as a Percent of Total","ITE Adjusted Average Daily Trips","Number of Person Trips","Reimbursement Fee","Improvement Fee","Compliance Fee","Total SDC per Unit","Description"]
[110,"General Light Industrial",{"$f":"A4&\" – \"&B4","v":"110 – General Light Industrial"},"1,000 SFGFA",1000,"SFGFA","SFGFA = Square Feet of Gross Floor Area","Square Feet (SF)",6.97,1,{"$f":"IFERROR(I4*J4,\"\")","v":6.97},{"$f":"IFERROR(K4*$A$2,\"\")","v":11.205051256390144},{"$f":"IFERROR(L4*$B$79,\"\")","v":1934.9778913635009},{"$f":"IFERROR(L4*$B$80,\"\")","v":10586.129045192178},{"$f":"IFERROR(L4*$B$81,\"\")","v":258.74704361256119},{"$f":"SUM(M4:O4)","v":12779.85398016824},"Light industrial facilities are free-standing facilities devoted to a single use. The facilities have an emphasis on activities other than manufacturing and typically have minimal office space. Typical light industrial activities include printing, material testing and assembly of data processing equipment. General heavy industrial (Land Use 120), industrial park (Land Use 130) and manufacturing (Land Use 140) are related uses."]
[120,"General Heavy Industrial","120 – General Heavy Industrial","1,000 SFGFA",1000,"SFGFA","SFGFA = Square Feet of Gross Floor Area","Square Feet (SF)",1.5,1,{"$f":"IFERROR(I5*J5,\"\")","v":1.5},{"$f":"IFERROR(K5*$A$2,\"\")","v":2.4114170566119393},416.42278867220256,2278.2200240729221,55.684442671282902,2750.3272554164073,"Heavy industrial facilities usually have a high number of employees per industrial plant and are generally limited to the manufacturing of large items. General light industrial (Land Use 110), industrial park (Land Use 130) and manufacturing (Land Use 140) are related uses."]
[130,"Industrial Park","130 – Industrial Park","1,000 SFGFA",1000,"SFGFA","SFGFA = Square Feet of Gross Floor Area","Square Feet (SF)",6.83,1,6.83,10.979985664439695,1896.111764420762,10373.495176278704,253.54982896324142,12523.156769662708,"Industrial parks contain a number of industrial or related facilities. They are characterized by a mix of manufacturing, service and warehouse facilities with a wide variation in the proportion of each type of use from one location to another. Many industrial parks contain highly diversified facilities—some with a large number of small businesses and others with one or two dominant industries. General light industrial (Land Use 110), general heavy industrial (Land Use 120), manufacturing (Land Use 140), high-cube warehouse/distribution center (Land Use 152) and business park (Land Use 770) are related uses."]
[140,"Manufacturing","140 – Manufacturing","1,000 SFGFA",1000,"SFGFA","SFGFA = Square Feet of Gross Floor Area","Square Feet (SF)",3.82,1,3.82,6.1410754375050711,1060.4900351518756,5801.866994639041,141.80971400286708,7004.1667437937831,"Manufacturing facilities are areas where the primary activity is the conversion of raw materials or parts into finished products. Size and type of activity may vary substanially from one facility to another. In addition to the actual production of goods, manufacturing facilities generally also have office, warehouse, research and assoicated functions. General light industrial (Land Use 110), general heavy industrial (Land Use 120), industrial park (Land Use 130) and high-cube warehouse/distribution center (Land Use 152) are related uses."]
[150,"Warehousing","150 – Warehousing","1,000 SFGFA",1000,"SFGFA","SFGFA = Square Feet of Gross Floor Area","Square Feet (SF)",3.56,1,3.56,5.723096481025669,988.31008511536072,5406.9755237997351,132.15774393984475,{"$f":"SUM(M8:O8)","v":6527.4433528549398},"Warehouses are primarily devoted to the storage of materials, but they may also include office and maintenance areas. High-cube warehouse/distribution center (Land Use 152) and business park (Land Use 770) are related uses."]
{"$rows_left_out":153}
{"sheet":"STORM","index":10,"n_rows":46,"n_cols":8,"rows_kept":46,"cut":false,"hidden":false,"merged":[[48,2,48,6],[16,2,16,6],[14,5,14,6],[18,2,18,6],[19,2,19,4],[27,5,27,6],[21,4,21,6],[20,2,20,4],[34,2,34,4],[35,2,35,4],[22,4,22,6],[23,4,23,6],[24,4,24,6],[25,4,25,6],[26,4,26,6],[28,5,28,6],[12,2,12,4],[13,5,13,6],[15,2,15,6],[1,2,2,6],[1,7,1,8],[2,7,2,8],[5,3,5,6],[11,2,11,4],[10,2,10,6]]}
[]
[null,null,"CHARGES & CREDITS » STORMWATER",null,null,null,null,"City of Wilsonville, OR"]
[null,null,null,null,null,null,null,"Community Development"]
[]
[]
["TYPE",null,"SUBJECT PROPERTY:",{"$f":"IF(ISBLANK(START!SITEADDR),\"\",IF(ISBLANK(START!SUITE),START!SITEADDR,START!SITEADDR & \", \" & START!SUITE))","v":""}]
[]
[]
{"$rows_left_out":39}
{"sheet":"_SDC Storm","index":11,"n_rows":11,"n_cols":11,"rows_kept":11,"cut":false,"hidden":true,"merged":[]}
["SDC Table: Storm"]
[]
["Calculation Type","Unit","Unit Long","Cost per Unit","Calculation Type Description",null,null,null,1.004]
["Residential Dwelling Unit","DU","Dwelling Unit",{"$f":"J4","v":2442},"<Description Needed>",null,null,2432,{"$f":"H4*$I$3","v":2441.7280000000001},{"$f":"ROUND(I4,0)","v":2442},2.5000000000000001E-2]
["Impervious Surface Area","SFISA1","Square Foot of Impervious Surface Area",{"$f":"J5","v":0.89},"<Description Needed>",null,null,{"$f":"2442/2750","v":0.88800000000000001},{"$f":"H5*$I$3","v":0.89155200000000001},{"$f":"ROUND(I5,2)","v":0.89},2.5000000000000001E-2]
[]
["Credit Type: Storm"]
[]
{"$rows_left_out":4}
{"sheet":"PARKS","index":12,"n_rows":47,"n_cols":8,"rows_kept":47,"cut":false,"hidden":false,"merged":[[49,2,49,6],[20,2,20,6],[26,5,26,6],[27,5,27,6],[22,2,22,4],[21,2,21,4],[23,2,23,6],[24,2,24,6],[25,2,25,6],[34,2,34,5],[33,2,33,5],[35,2,35,5],[36,2,36,5],[44,2,44,3],[43,2,43,3],[39,2,39,5],[1,7,1,8],[2,7,2,8],[5,3,5,6],[16,5,16,6],[1,2,2,6],[17,5,17,6],[11,2,11,4],[12,2,12,4],[10,2,10,6],[13,2,13,6],[14,2,14,6],[15,2,15,6]]}
[]
[null,null,"CHARGES & CREDITS » PARKS",null,null,null,null,"City of Wilsonville, OR"]
[null,null,null,null,null,null,null,"Community Development"]
[]
[]
["TYPE",null,"SUBJECT PROPERTY:",{"$f":"IF(ISBLANK(START!SITEADDR),\"\",IF(ISBLANK(START!SUITE),START!SITEADDR,START!SITEADDR & \", \" & START!SUITE))","v":""}]
[]
[]
{"$rows_left_out":40}
{"sheet":"_SDC Parks","index":13,"n_rows":34,"n_cols":6,"rows_kept":34,"cut":false,"hidden":true,"merged":[]}
["SDC Table: Parks"]
[]
["Development Type","Development Type Description","Unit","Unit Long","Cost per Unit","Unit Factor"]
["Single Family/Duplex","Unit count to be entered per Dwelling Unit","DU","DU = Dwelling Unit",{"$f":"14000*1.004","v":14056},1]
["Mobile Home Dwelling Unit","Unit count to be entered per Dwelling Unit","DU","DU = Dwelling Unit",{"$f":"10208*1.004","v":10248.832},1]
["Multifamily","Unit count to be entered per Dwelling Unit","DU","DU = Dwelling Unit",{"$f":"9403.89*1.004","v":9441.5055599999996},1]
[]
["SIC 1-19: Agriculture; Fish & Forest Services; Construction; Mining","Includes establishments engaged in the production of crops, livestock, and animal specialties, or providing agricultural services. This category also includes any forestry, fishing, hunting, or trapping establishments. General building contractors, electrical work, utility construction, and heavy construction establishments are also included in this category, as well as those related to the extraction of oil, gas, ores, and quarries.","TGSF","TGSF = Thousand Gross Square Feet",{"$f":"1.004*465.19","v":467.05076000000003},1000]
{"$rows_left_out":27}
{"sheet":"VOUCHERS","index":14,"n_rows":19,"n_cols":8,"rows_kept":19,"cut":false,"hidden":true,"merged":[[1,2,2,6],[1,7,1,8],[2,7,2,8],[5,3,5,6],[21,2,21,6],[11,3,11,4],[12,3,12,4],[13,3,13,4],[14,3,14,4],[15,3,15,4],[16,3,16,4]]}
[]
[null,null,"VOUCHERS",null,null,null,null,"City of Wilsonville, OR"]
[null,null,null,null,null,null,null,"Community Development"]
[]
[]
["HIDE",null,"SUBJECT PROPERTY:",{"$f":"IF(ISBLANK(START!SITEADDR),\"\",IF(ISBLANK(START!SUITE),START!SITEADDR,START!SITEADDR & \", \" & START!SUITE))","v":""}]
[]
[]
{"$rows_left_out":12}
{"sheet":"_SDC Vouchers","index":15,"n_rows":8,"n_cols":1,"rows_kept":8,"cut":false,"hidden":true,"merged":[]}
["SDC Table: Parks"]
[]
["Voucher Type"]
["Water"]
["Sanitary Sewer"]
["Transportation"]
["Stormwater"]
["Parks"]
{"$rows_left_out":1}
{"sheet":"SUMMARY","index":16,"n_rows":37,"n_cols":9,"rows_kept":37,"cut":false,"hidden":false,"merged":[[34,3,34,6],[23,3,23,6],[24,3,24,6],[30,3,30,6],[32,3,32,6],[27,3,27,6],[14,3,14,6],[1,3,2,7],[31,3,31,6],[33,3,33,6],[1,8,1,9],[2,8,2,9],[5,4,5,7],[10,3,10,6],[12,3,12,6],[13,3,13,6],[11,3,11,6],[29,3,29,6],[28,3,28,6],[25,3,25,6],[26,3,26,6],[18,3,18,6],[21,3,21,6],[22,3,22,6],[20,3,20,6],[15,3,15,6],[16,3,16,6],[17,3,17,6],[19,3,19,6]]}
[]
[null,null,null,"SUMMARY SHEET",null,null,null,null,"City of Wilsonville, OR"]
[null,null,null,null,null,null,null,null,"Community Development"]
[]
[]
["HIDE","TYPE",null,"SUBJECT PROPERTY:",{"$f":"IF(ISBLANK(START!SITEADDR),\"\",IF(ISBLANK(START!SUITE),START!SITEADDR,START!SITEADDR & \", \" & START!SUITE))","v":""}]
[]
[]
{"$rows_left_out":30}
{"sheet":"_ITE Codes","index":17,"n_rows":69,"n_cols":14,"rows_kept":69,"cut":false,"hidden":true,"merged":[[0,3,0,6],[0,8,0,11],[0,12,0,13]]}
[null,null,null,"Daily Trips",null,null,null,null,"Trip Categories",null,null,null,"Adjusted Trip Rates"]
["ITE Code","Land Use","Unit","Weekday","Saturday","Sunday","Average","Weekday PM \nPeak-Hour Trips","Primary","Pass By","Diverted Linked","Total","Daily","Weekday PM \nPeak-Hour"]
[21,"Commercial Airport","CFD",122.21,113.04,137.71,{"$f":"IFERROR(((D3*5)+(AVERAGE(E3:F3)*2))/7,D3)","v":123.11428571428571},8.1999999999999993,{"$f":"L3-SUM(J3:K3)","v":1},null,null,1,{"$f":"G3*I3","v":123.11428571428571},{"$f":"H3*I3","v":8.1999999999999993}]
[30,"Intermodal Truck Terminal","Acre",81.900000000000006,17.28,10.79,62.51,7.24,1,null,null,1,{"$f":"G4*I4","v":62.51},{"$f":"H4*I4","v":7.24}]
[110,"General Light Industrial","1,000 SFGFA",6.97,1.32,0.68,5.2642857142857142,1.08,1,null,null,1,5.2642857142857142,1.08]
[130,"Industrial Park","1,000 SFGFA",6.83,2.4900000000000002,0.73,5.3385714285714281,0.84,1,null,null,1,5.3385714285714281,0.84]
[140,"Manufacturing","1,000 SFGFA",3.82,1.49,0.62,3.03,0.75,1,null,null,1,3.03,0.75]
[151,"Mini-Warehouse","1,000 SFGFA",2.5,2.33,1.78,2.3728571428571428,0.28999999999999998,1,null,null,1,2.3728571428571428,0.28999999999999998]
{"$rows_left_out":61}